Target
Protein-glutamine gamma-glutamyltransferase 2
Ligand
BDBM59175
Substrate
Meas. Tech.
TG Inhibition Assay
pH
7.2±0
Ki
430000±0.0 nM
Citation
 Choi, KSiegel, MPiper, JLYuan, LCho, EStrnad, POmary, BRich, KMKhosla, C Chemistry and biology of dihydroisoxazole derivatives: selective inhibitors of human transglutaminase 2. Chem Biol 12:469-75 (2005)  
Target
Name:
Protein-glutamine gamma-glutamyltransferase 2
Synonyms:
Protein-glutamine gamma-glutamyltransferase TGM2 Tissue transglutaminase Transglutaminase 2 (TGM2) Transglutaminase-2
Type:
Protein
Mol. Mass.:
77309.30
Organism:
Homo sapiens (Human)
Description:
P21980
Residue:
687
  
Inhibitor
Name:
BDBM59175
Synonyms:
Dihydroisoxazole, 1c
Type:
Small organic molecule
Emp. Form.:
C22H23BrFN3O4
Mol. Mass.:
492.338
SMILES:
Fc1ccc(CC[C@H](NC(=O)OCc2ccccc2)C(=O)NCC2CC(Br)=NO2)cc1
: