Target
Cyclin-dependent kinase 5
Ligand
BDBM50155420
Substrate
Meas. Tech.
In Vitro Kinase Assay of Tau Phosphorylation
IC50
7e+2±n/a nM
Citation
 Ahn, JSRadhakrishnan, MLMapelli, MChoi, STidor, BCuny, GDMusacchio, AYeh, LAKosik, KS Defining Cdk5 ligand chemical space with small molecule inhibitors of tau phosphorylation. Chem Biol 12:811-23 (2005)  
Target
Name:
Cyclin-dependent kinase 5
Synonyms:
CDK5 CDKN5 Cyclin-dependent kinase 5 (CDK5/ p25) Cyclin-dependent-like kinase 5 PSSALRE Tau protein kinase II catalytic subunit
Type:
Enzyme Subunit
Mol. Mass.:
33308.61
Organism:
Homo sapiens (Human)
Description:
Residue:
292
  
Inhibitor
Name:
BDBM50155420
Synonyms:
1,5,8-Trihydroxy-3-methoxy-xanthen-9-one CHEMBL185776 | Xanthen-9-one, 1.1
Type:
Small organic molecule
Emp. Form.:
C14H10O6
Mol. Mass.:
274.2256
SMILES:
COc1cc(O)c2c(c1)oc1c(O)ccc(O)c1c2=O
: