Target
Cyclin-dependent kinase 5
Ligand
BDBM59199
Substrate
Meas. Tech.
In Vitro Kinase Assay of Tau Phosphorylation
IC50
1.70e+4±n/a nM
Citation
 Ahn, JSRadhakrishnan, MLMapelli, MChoi, STidor, BCuny, GDMusacchio, AYeh, LAKosik, KS Defining Cdk5 ligand chemical space with small molecule inhibitors of tau phosphorylation. Chem Biol 12:811-23 (2005)  
Target
Name:
Cyclin-dependent kinase 5
Synonyms:
CDK5 CDKN5 Cyclin-dependent kinase 5 (CDK5/ p25) Cyclin-dependent-like kinase 5 PSSALRE Tau protein kinase II catalytic subunit
Type:
Enzyme Subunit
Mol. Mass.:
33308.61
Organism:
Homo sapiens (Human)
Description:
Residue:
292
  
Inhibitor
Name:
BDBM59199
Synonyms:
2,3-dihydro-1H-4-oxa-2,5-diazaphenanthrenes, 3.0
Type:
Small organic molecule
Emp. Form.:
C23H24ClN3O
Mol. Mass.:
393.909
SMILES:
Clc1cc2CN(COc2c2ncccc12)C1CCN(Cc2ccccc2)CC1
: