Target
Cyclin-dependent kinase/G2/mitotic-specific cyclin- 1
Ligand
BDBM50079331
Substrate
Meas. Tech.
In Vitro Kinase Assay
IC50
485±n/a nM
Citation
 Caligiuri, MBecker, FMurthi, KKaplan, FDedier, SKaufmann, CMachl, AZybarth, GRichard, JBockovich, NKluge, AKley, N A proteome-wide CDK/CRK-specific kinase inhibitor promotes tumor cell death in the absence of cell cycle progression. Chem Biol 12:1103-15 (2005)  
Target
Name:
Cyclin-dependent kinase/G2/mitotic-specific cyclin- 1
Synonyms:
CDK1/B CDK1/CyclinB Cyclin-Dependent Kinase 1 (CDK1) Cyclin-dependent kinase/G2/mitotic-specific cyclin 1 | cdk1
Type:
Protein Complex
Mol. Mass.:
Description:
CDK1/Cyclin B complexes were purified from insect cells co-infected with baculovirus vectors containing each of the components.
Components:
This complex has 2 components.
Component 1
Name:
Cyclin-dependent kinase 1
Synonyms:
CDC2 CDK1 CDKN1 Cell division protein kinase 1 P34CDC2 | p34 protein kinase
Type:
Enzyme Subunit
Mol. Mass.:
34101.08
Organism:
Homo sapiens (Human)
Description:
P06493
Residue:
297
  
Component 2
Name:
G2/mitotic-specific cyclin-B1
Synonyms:
CCNB CCNB1_HUMAN
Type:
Enzyme Subunit
Mol. Mass.:
48340.95
Organism:
Homo sapiens (Human)
Description:
P14635
Residue:
433
  
Inhibitor
Name:
BDBM50079331
Synonyms:
2-(2-Chloro-phenyl)-5,7-dihydroxy-8-(3-hydroxy-1-methyl-piperidin-4-yl)-chromen-4-one CHEMBL418203 | Flavopiridol
Type:
Small organic molecule
Emp. Form.:
C21H20ClNO5
Mol. Mass.:
401.84
SMILES:
CN1CCC([C@@H](O)C1)c1c(O)cc(O)c2c1oc(cc2=O)-c1ccccc1Cl
: