Target
Alkaline phosphatase, germ cell type
Ligand
BDBM39588
Substrate
Meas. Tech.
Luminescent assay for HTS discovery of chemical activators of placental alkaline phosphatase
EC50
54500±n/a nM
Citation
 PubChem, PC Luminescent assay for HTS discovery of chemical activators of placental alkaline phosphatase PubChem Bioassay (2007)[AID] 
Target
Name:
Alkaline phosphatase, germ cell type
Synonyms:
ALPG ALPPL2 PPBN_HUMAN | placental-like alkaline phosphatase preproprotein
Type:
PROTEIN
Mol. Mass.:
57374.31
Organism:
Homo sapiens (Human)
Description:
ChEMBL_29964
Residue:
532
  
Inhibitor
Name:
BDBM39588
Synonyms:
MLS000038887 SMR000038797 cid_657844 | dimorpholinophosphoryl(piperidino)methanone oxime
Type:
Small organic molecule
Emp. Form.:
C14H27N4O4P
Mol. Mass.:
346.3623
SMILES:
O=NC(N1CCCCC1)P(=O)(N1CCOCC1)N1CCOCC1
: