Target
Alkaline phosphatase, germ cell type
Ligand
BDBM34599
Substrate
Meas. Tech.
Luminescent assay for HTS discovery of chemical activators of placental alkaline phosphatase
EC50
999000±n/a nM
Citation
 PubChem, PC Luminescent assay for HTS discovery of chemical activators of placental alkaline phosphatase PubChem Bioassay (2007)[AID] 
Target
Name:
Alkaline phosphatase, germ cell type
Synonyms:
ALPG ALPPL2 PPBN_HUMAN | placental-like alkaline phosphatase preproprotein
Type:
PROTEIN
Mol. Mass.:
57374.31
Organism:
Homo sapiens (Human)
Description:
ChEMBL_29964
Residue:
532
  
Inhibitor
Name:
BDBM34599
Synonyms:
1-[5-chloranyl-2-(trifluoromethyl)-1,3-benzodioxol-2-yl]-3-(6-morpholin-4-ylpyrimidin-4-yl)urea 1-[5-chloro-2-(trifluoromethyl)-1,3-benzodioxol-2-yl]-3-(6-morpholinopyrimidin-4-yl)urea MLS000085600 SMR000020535 | cid_3236557
Type:
Small organic molecule
Emp. Form.:
C17H15ClF3N5O4
Mol. Mass.:
445.78
SMILES:
FC(F)(F)C1(NC(=O)Nc2cc(ncn2)N2CCOCC2)Oc2ccc(Cl)cc2O1
: