Target
Alkaline phosphatase, germ cell type
Ligand
BDBM39634
Substrate
Meas. Tech.
Luminescent assay for HTS discovery of chemical activators of placental alkaline phosphatase
EC50
999000±n/a nM
Citation
 PubChem, PC Luminescent assay for HTS discovery of chemical activators of placental alkaline phosphatase PubChem Bioassay (2007)[AID] 
Target
Name:
Alkaline phosphatase, germ cell type
Synonyms:
ALPG ALPPL2 PPBN_HUMAN | placental-like alkaline phosphatase preproprotein
Type:
PROTEIN
Mol. Mass.:
57374.31
Organism:
Homo sapiens (Human)
Description:
ChEMBL_29964
Residue:
532
  
Inhibitor
Name:
BDBM39634
Synonyms:
4-fluoranyl-N-[2-(4-methylphenyl)sulfanylethyl]benzenesulfonamide 4-fluoro-N-[2-(p-tolylthio)ethyl]benzenesulfonamide MLS000111021 cid_2275256
Type:
Small organic molecule
Emp. Form.:
C15H16FNO2S2
Mol. Mass.:
325.421
SMILES:
Cc1ccc(SCCNS(=O)(=O)c2ccc(F)cc2)cc1
: