Target
Alkaline phosphatase, germ cell type
Ligand
BDBM39645
Substrate
Meas. Tech.
Luminescent assay for HTS discovery of chemical activators of placental alkaline phosphatase
EC50
999000±n/a nM
Citation
 PubChem, PC Luminescent assay for HTS discovery of chemical activators of placental alkaline phosphatase PubChem Bioassay (2007)[AID] 
Target
Name:
Alkaline phosphatase, germ cell type
Synonyms:
ALPG ALPPL2 PPBN_HUMAN | placental-like alkaline phosphatase preproprotein
Type:
PROTEIN
Mol. Mass.:
57374.31
Organism:
Homo sapiens (Human)
Description:
ChEMBL_29964
Residue:
532
  
Inhibitor
Name:
BDBM39645
Synonyms:
2-(5-Phenyl-2H-[1,2,4]triazol-3-yl)-3a,4,7,7a-tetrahydro-isoindole-1,3-dione 2-(5-phenyl-1H-1,2,4-triazol-3-yl)-3a,4,7,7a-tetrahydroisoindole-1,3-quinone SMR000120899 | cid_2946732
Type:
Small organic molecule
Emp. Form.:
C16H14N4O2
Mol. Mass.:
294.308
SMILES:
Oc1c2CC=CCc2c(O)n1-c1nnc([nH]1)-c1ccccc1
: