Target
Alkaline phosphatase, germ cell type
Ligand
BDBM39655
Substrate
Meas. Tech.
Luminescent assay for HTS discovery of chemical activators of placental alkaline phosphatase
EC50
999000±n/a nM
Citation
 PubChem, PC Luminescent assay for HTS discovery of chemical activators of placental alkaline phosphatase PubChem Bioassay (2007)[AID] 
Target
Name:
Alkaline phosphatase, germ cell type
Synonyms:
ALPG ALPPL2 PPBN_HUMAN | placental-like alkaline phosphatase preproprotein
Type:
PROTEIN
Mol. Mass.:
57374.31
Organism:
Homo sapiens (Human)
Description:
ChEMBL_29964
Residue:
532
  
Inhibitor
Name:
BDBM39655
Synonyms:
(4-butoxy-3-nitro-phenyl)methyl carbamimidothioate;hydrochloride 2-(4-Butoxy-3-nitro-benzyl)-isothiourea MLS000552577 carbamimidothioic acid (4-butoxy-3-nitrophenyl)methyl ester;hydrochloride | cid_9550137
Type:
Small organic molecule
Emp. Form.:
C12H17N3O3S
Mol. Mass.:
283.347
SMILES:
CCCCOc1ccc(CSC(N)=N)cc1[N+]([O-])=O
: