Target
Alkaline phosphatase, germ cell type
Ligand
BDBM39679
Substrate
Meas. Tech.
Luminescent assay for HTS discovery of chemical activators of placental alkaline phosphatase
EC50
9080±n/a nM
Citation
 PubChem, PC Luminescent assay for HTS discovery of chemical activators of placental alkaline phosphatase PubChem Bioassay (2007)[AID] 
Target
Name:
Alkaline phosphatase, germ cell type
Synonyms:
ALPG ALPPL2 PPBN_HUMAN | placental-like alkaline phosphatase preproprotein
Type:
PROTEIN
Mol. Mass.:
57374.31
Organism:
Homo sapiens (Human)
Description:
ChEMBL_29964
Residue:
532
  
Inhibitor
Name:
BDBM39679
Synonyms:
(Z)-[2-keto-3-(p-tolyl)-5-pyridin-1-ium-1-yl-3-imidazolin-4-ylidene]methanolate (Z)-[3-(4-methylphenyl)-2-oxo-5-(1-pyridin-1-iumyl)-4-imidazolylidene]methanolate MLS000518917 cid_6096357
Type:
Small organic molecule
Emp. Form.:
C16H13N3O2
Mol. Mass.:
279.2933
SMILES:
Cc1ccc(cc1)-n1c(C=O)c([n-]c1=O)-[n+]1ccccc1
: