Target
Alkaline phosphatase, tissue-nonspecific isozyme
Ligand
BDBM50309
Substrate
Meas. Tech.
uHTS identification of compounds activating TNAP in the absence of phosphate acceptor performed in luminescent assay
EC50
100000±n/a nM
Citation
 PubChem, PC uHTS identification of compounds activating TNAP in the absence of phosphate acceptor performed in luminescent assay PubChem Bioassay (2009)[AID] 
Target
Name:
Alkaline phosphatase, tissue-nonspecific isozyme
Synonyms:
ALPL tissue-nonspecific alkaline phosphatase precursor
Type:
PROTEIN
Mol. Mass.:
57306.17
Organism:
Homo sapiens (Human)
Description:
ChEMBL_1448917
Residue:
524
  
Inhibitor
Name:
BDBM50309
Synonyms:
MLS000720336 N-[2-[(4-methoxy-1,3-benzothiazol-2-yl)amino]-1,3-benzothiazol-6-yl]ethanamide cid_7105772
Type:
Small organic molecule
Emp. Form.:
C17H14N4O2S2
Mol. Mass.:
370.449
SMILES:
COc1cccc2sc(Nc3nc4ccc(NC(C)=O)cc4s3)nc12
: