Target
E3 ubiquitin-protein ligase XIAP
Ligand
BDBM59386
Substrate
Meas. Tech.
Chemical Antagonists IAP-family anti-apoptotic proteins
IC50
100000±n/a nM
Citation
 PubChem, PC Chemical Antagonists IAP-family anti-apoptotic proteins PubChem Bioassay (2008)[AID] 
Target
Name:
E3 ubiquitin-protein ligase XIAP
Synonyms:
API3 E3 ubiquitin-protein ligase XIAP Inhibitor of apoptosis protein 3 X-linked inhibitor of apoptosis XIAP | XIAP_HUMAN
Type:
Protein
Mol. Mass.:
56685.27
Organism:
Homo sapiens (Human)
Description:
P98170
Residue:
497
  
Inhibitor
Name:
BDBM59386
Synonyms:
1-(8-quinolinylsulfonyl)-N-(3,4,5-trimethoxyphenyl)-2-pyrrolidinecarboxamide 1-quinolin-8-ylsulfonyl-N-(3,4,5-trimethoxyphenyl)pyrrolidine-2-carboxamide SMR000096025 | cid_5309619
Type:
Small organic molecule
Emp. Form.:
C23H25N3O6S
Mol. Mass.:
471.526
SMILES:
COc1cc(NC(=O)C2CCCN2S(=O)(=O)c2cccc3cccnc23)cc(OC)c1OC
: