Target
E3 ubiquitin-protein ligase XIAP
Ligand
BDBM59483
Substrate
Meas. Tech.
Chemical Antagonists IAP-family anti-apoptotic proteins
IC50
100000±n/a nM
Citation
 PubChem, PC Chemical Antagonists IAP-family anti-apoptotic proteins PubChem Bioassay (2008)[AID] 
Target
Name:
E3 ubiquitin-protein ligase XIAP
Synonyms:
API3 E3 ubiquitin-protein ligase XIAP Inhibitor of apoptosis protein 3 X-linked inhibitor of apoptosis XIAP | XIAP_HUMAN
Type:
Protein
Mol. Mass.:
56685.27
Organism:
Homo sapiens (Human)
Description:
P98170
Residue:
497
  
Inhibitor
Name:
BDBM59483
Synonyms:
MLS000735433 [1-[(1-methylpyrazol-4-yl)methyl]-4-p-anisyl-4-piperidyl]methanol [4-[(4-methoxyphenyl)methyl]-1-[(1-methylpyrazol-4-yl)methyl]piperidin-4-yl]methanol {4-(4-methoxybenzyl)-1-[(1-methyl-1H-pyrazol-4-yl)methyl]piperidin-4-yl}methanol
Type:
Small organic molecule
Emp. Form.:
C19H27N3O2
Mol. Mass.:
329.4366
SMILES:
COc1ccc(CC2(CO)CCN(Cc3cnn(C)c3)CC2)cc1
: