Target
Nucleotide-binding oligomerization domain-containing protein 1
Ligand
BDBM54409
Substrate
Meas. Tech.
uHTS luminescence assay for the identification of compounds that inhibit NOD1
EC50
850±n/a nM
Citation
 PubChem, PC uHTS luminescence assay for the identification of compounds that inhibit NOD1 PubChem Bioassay (2010)[AID] 
Target
Name:
Nucleotide-binding oligomerization domain-containing protein 1
Synonyms:
CARD4 NOD1_HUMAN | nucleotide-binding oligomerization domain containing 1
Type:
Enzyme Catalytic Domain
Mol. Mass.:
107699.03
Organism:
Homo sapiens (Human)
Description:
gi_5174617
Residue:
953
  
Inhibitor
Name:
BDBM54409
Synonyms:
4-[4-(3,4-Dihydro-1H-isoquinolin-2-ylmethyl)-benzoylamino]-benzoic acid ethyl ester 4-[[[4-(3,4-dihydro-1H-isoquinolin-2-ylmethyl)phenyl]-oxomethyl]amino]benzoic acid ethyl ester MLS001209846 cid_1106361 ethyl 4-[[4-(3,4-dihydro-1H-isoquinolin-2-ylmethyl)phenyl]carbonylamino]benzoate
Type:
Small organic molecule
Emp. Form.:
C26H26N2O3
Mol. Mass.:
414.4962
SMILES:
CCOC(=O)c1ccc(NC(=O)c2ccc(CN3CCc4ccccc4C3)cc2)cc1
: