Target
Nucleotide-binding oligomerization domain-containing protein 1
Ligand
BDBM54470
Substrate
Meas. Tech.
uHTS luminescence assay for the identification of compounds that inhibit NOD1
EC50
1670±n/a nM
Citation
 PubChem, PC uHTS luminescence assay for the identification of compounds that inhibit NOD1 PubChem Bioassay (2010)[AID] 
Target
Name:
Nucleotide-binding oligomerization domain-containing protein 1
Synonyms:
CARD4 NOD1_HUMAN | nucleotide-binding oligomerization domain containing 1
Type:
Enzyme Catalytic Domain
Mol. Mass.:
107699.03
Organism:
Homo sapiens (Human)
Description:
gi_5174617
Residue:
953
  
Inhibitor
Name:
BDBM54470
Synonyms:
1-[2-methyl-5-[4-(4-nitrophenyl)piperazin-1-yl]sulfonyl-2,3-dihydroindol-1-yl]propan-1-one 1-[2-methyl-5-[[4-(4-nitrophenyl)-1-piperazinyl]sulfonyl]-2,3-dihydroindol-1-yl]-1-propanone MLS000950704 cid_16002787
Type:
Small organic molecule
Emp. Form.:
C22H26N4O5S
Mol. Mass.:
458.531
SMILES:
CCC(=O)N1C(C)Cc2cc(ccc12)S(=O)(=O)N1CCN(CC1)c1ccc(cc1)[N+]([O-])=O
: