Target
Gag-Pol polyprotein [588-1027]/[588-1147]
Ligand
BDBM2303
Substrate
poly(A)/oligo(dT)
Meas. Tech.
HIV-1 RT Assay
pH
8.3±n/a
Temperature
310.15±n/a K
IC50
1800±n/a nM
Citation
 Romero, DLMorge, RAGenin, MJBiles, CBusso, MResnick, LAlthaus, IWReusser, FThomas, RCTarpley, WG Bis(heteroaryl)piperazine (BHAP) reverse transcriptase inhibitors: structure-activity relationships of novel substituted indole analogues and the identification of 1-[(5-methanesulfonamido-1H-indol-2-yl)-carbonyl]-4-[3- [(1-methylethyl)amino]-pyridinyl]piperazine monomethanesulfonate (U-90152S), a  J Med Chem 36:1505-8 (1993)  
Target
Name:
Gag-Pol polyprotein [588-1027]/[588-1147]
Synonyms:
EC: 2.7.7.49 | HIV-1 Reverse Transcriptase
Type:
Protein Complex
Mol. Mass.:
115684
Description:
Components:
This complex has 2 components.
Component 1
Name:
Gag-Pol polyprotein [588-1147]
Synonyms:
HIV-1 Reverse Transcriptase Chain A gag-pol
Type:
Enzyme Subunit
Mol. Mass.:
64486.41
Organism:
Human immunodeficiency virus type 1
Description:
P04585[588-1147]
Residue:
560
  
Component 2
Name:
Gag-Pol polyprotein [588-1027]
Synonyms:
HIV-1 Reverse Transcriptase Chain B gag-pol
Type:
Enzyme Subunit
Mol. Mass.:
51337.13
Organism:
Human immunodeficiency virus type 1
Description:
P04585[588-1027]
Residue:
440
  
Inhibitor
Name:
BDBM2303
Synonyms:
5- or 6-Substituted Indole BHAP analogue 17 | N-[2-({4-[3-(propan-2-ylamino)pyridin-2-yl]piperazin-1-yl}carbonyl)-1H-indol-5-yl]acetamide
Type:
Small organic molecule
Emp. Form.:
C23H28N6O2
Mol. Mass.:
420.5074
SMILES:
CC(C)Nc1cccnc1N1CCN(CC1)C(=O)c1cc2cc(NC(C)=O)ccc2[nH]1
:
Substrate
Name:
poly(A)/oligo(dT)
Synonyms:
Type:
RNA/DNA Duplex
Mol. Mass.:
358.43
Organism:
Description:
The incorporation of Tritium-labeled TTP onto a poly(rA):oligo(dT) template:primer.
Residue:
3
NA