Target
M17 leucyl aminopeptidase
Ligand
BDBM60125
Substrate
Meas. Tech.
Inhibitors of Plasmodium falciparum M17- Family Leucine Aminopeptidase (M17LAP)
IC50
1000±n/a nM
Citation
 PubChem, PC Inhibitors of Plasmodium falciparum M17- Family Leucine Aminopeptidase (M17LAP) PubChem Bioassay (2009)[AID] 
Target
Name:
M17 leucyl aminopeptidase
Synonyms:
leucine aminopeptidase
Type:
Enzyme Catalytic Domain
Mol. Mass.:
67834.32
Organism:
Plasmodium falciparum 3D7
Description:
gi_124809582
Residue:
605
  
Inhibitor
Name:
BDBM60125
Synonyms:
1,2,3,4,7,7-hexachloro-6-(p-phenetylcarbamoyl)bicyclo[2.2.1]hept-2-ene-5-carboxylic acid 1,2,3,4,7,7-hexachloro-6-[(4-ethoxyphenyl)carbamoyl]bicyclo[2.2.1]hept-2-ene-5-carboxylic acid MLS000713583 cid_3122377
Type:
Small organic molecule
Emp. Form.:
C17H13Cl6NO4
Mol. Mass.:
508.007
SMILES:
CCOc1ccc(NC(=O)C2C(C(O)=O)C3(Cl)C(Cl)=C(Cl)C2(Cl)C3(Cl)Cl)cc1
: