Target
Dual specificity protein phosphatase 3
Ligand
BDBM46212
Substrate
Meas. Tech.
uHTS absorbance assay for the identification of compounds that inhibit VHR1.
IC50
5010±n/a nM
Citation
 PubChem, PC uHTS absorbance assay for the identification of compounds that inhibit VHR1. PubChem Bioassay (2009)[AID] 
Target
Name:
Dual specificity protein phosphatase 3
Synonyms:
DUS3_HUMAN Dual specificity protein phosphatase (VHR) Dual specificity protein phosphatase VHR Tyrosine-protein phosphatase non-receptor type 1 | VHR
Type:
Hydrolase
Mol. Mass.:
20480.58
Organism:
Homo sapiens (Human)
Description:
Residue:
185
  
Inhibitor
Name:
BDBM46212
Synonyms:
2-[2-chloranyl-6-methoxy-4-[(Z)-[3-[2-[(4-methylphenyl)amino]-2-oxidanylidene-ethyl]-2,4-bis(oxidanylidene)-1,3-thiazolidin-5-ylidene]methyl]phenoxy]ethanoic acid 2-[2-chloro-6-methoxy-4-[(Z)-[3-[2-(4-methylanilino)-2-oxoethyl]-2,4-dioxo-1,3-thiazolidin-5-ylidene]methyl]phenoxy]acetic acid MLS-0350105.0001 | cid_9512029
Type:
Small organic molecule
Emp. Form.:
C22H19ClN2O7S
Mol. Mass.:
490.913
SMILES:
COc1cc(\C=C2/SC(=O)N(CC(=O)Nc3ccc(C)cc3)C2=O)cc(Cl)c1OCC(O)=O
: