Target
Dual specificity protein phosphatase 3
Ligand
BDBM46224
Substrate
Meas. Tech.
uHTS absorbance assay for the identification of compounds that inhibit VHR1.
IC50
10500±n/a nM
Citation
 PubChem, PC uHTS absorbance assay for the identification of compounds that inhibit VHR1. PubChem Bioassay (2009)[AID] 
Target
Name:
Dual specificity protein phosphatase 3
Synonyms:
DUS3_HUMAN Dual specificity protein phosphatase (VHR) Dual specificity protein phosphatase VHR Tyrosine-protein phosphatase non-receptor type 1 | VHR
Type:
Hydrolase
Mol. Mass.:
20480.58
Organism:
Homo sapiens (Human)
Description:
Residue:
185
  
Inhibitor
Name:
BDBM46224
Synonyms:
2-[2-bromanyl-4-[(Z)-[2-[(4-ethylphenyl)amino]-4-oxidanylidene-1,3-thiazol-5-ylidene]methyl]-6-methoxy-phenoxy]ethanoic acid 2-[2-bromo-4-[(Z)-[2-(4-ethylanilino)-4-oxo-1,3-thiazol-5-ylidene]methyl]-6-methoxyphenoxy]acetic acid MLS-0343544.0001 | cid_5765581
Type:
Small organic molecule
Emp. Form.:
C21H19BrN2O5S
Mol. Mass.:
491.355
SMILES:
CCc1ccc(NC2=NC(=O)C(S2)=Cc2cc(Br)c(OCC(O)=O)c(OC)c2)cc1
: