Target
Kappa-type opioid receptor
Ligand
BDBM60264
Substrate
Meas. Tech.
uHTS identification of small molecule antagonists of the kappa opioid receptor via a luminescent beta-arrestin assay
IC50
3750±n/a nM
Citation
 PubChem, PC uHTS identification of small molecule antagonists of the kappa opioid receptor via a luminescent beta-arrestin assay PubChem Bioassay (2009)[AID] 
Target
Name:
Kappa-type opioid receptor
Synonyms:
K-OR-1 Kappa-opioid receptor (KOR) Kappa-type opioid receptor (KOR) OPIATE Kappa OPRK1 kappa opioid receptor (KOR)
Type:
G Protein-Coupled Receptor (GPCR)
Mol. Mass.:
42648.76
Organism:
Homo sapiens (Human)
Description:
P41145
Residue:
380
  
Inhibitor
Name:
BDBM60264
Synonyms:
2-(4-Bromo-phenyl)-quinoline-4-carboxylic acid [1-pyridin-2-yl-meth-(E)-ylidene]-hydrazide 2-(4-bromophenyl)-N-(2-pyridylmethyleneamino)cinchoninamide MLS000767800 cid_1970900
Type:
Small organic molecule
Emp. Form.:
C22H15BrN4O
Mol. Mass.:
431.285
SMILES:
Brc1ccc(cc1)-c1cc(C(=O)NN=Cc2ccccn2)c2ccccc2n1
: