Target
Plectin
Ligand
BDBM54920
Substrate
Meas. Tech.
uHTS identification of small molecule antagonists of the binding of Siah-1 and a peptide ligand via a fluorescence polarization assay.
IC50
200000±n/a nM
Citation
 PubChem, PC uHTS identification of small molecule antagonists of the binding of Siah-1 and a peptide ligand via a fluorescence polarization assay. PubChem Bioassay (2009)[AID] 
Target
Name:
Plectin
Synonyms:
PLEC PLEC_HUMAN | plectin 1
Type:
Enzyme Catalytic Domain
Mol. Mass.:
531740.96
Organism:
Homo sapiens (Human)
Description:
Q15149
Residue:
4684
  
Inhibitor
Name:
BDBM54920
Synonyms:
2-[[4,5-bis(dimethylamino)-1-naphthalenyl]methylidene]propanedinitrile 2-[[4,5-bis(dimethylamino)naphthalen-1-yl]methylidene]propanedinitrile SMR000261739 | cid_2316406
Type:
Small organic molecule
Emp. Form.:
C18H18N4
Mol. Mass.:
290.3623
SMILES:
[#6]-[#7](-[#6])-c1cccc2c(\[#6]=[#6](\C#N)C#N)ccc(-[#7](-[#6])-[#6])c12
: