Target
Plectin
Ligand
BDBM60319
Substrate
Meas. Tech.
uHTS identification of small molecule antagonists of the binding of Siah-1 and a peptide ligand via a fluorescence polarization assay.
IC50
200000±n/a nM
Citation
 PubChem, PC uHTS identification of small molecule antagonists of the binding of Siah-1 and a peptide ligand via a fluorescence polarization assay. PubChem Bioassay (2009)[AID] 
Target
Name:
Plectin
Synonyms:
PLEC PLEC_HUMAN | plectin 1
Type:
Enzyme Catalytic Domain
Mol. Mass.:
531740.96
Organism:
Homo sapiens (Human)
Description:
Q15149
Residue:
4684
  
Inhibitor
Name:
BDBM60319
Synonyms:
1-[(1-cyclopentyl-1,2,3,4-tetrazol-5-yl)-pyridin-2-yl-methyl]-4-(diphenylmethyl)piperazine 1-benzhydryl-4-[(1-cyclopentyltetrazol-5-yl)-(2-pyridyl)methyl]piperazine MLS000708175 cid_3229177
Type:
Small organic molecule
Emp. Form.:
C29H33N7
Mol. Mass.:
479.6192
SMILES:
C1CCC(C1)n1nnnc1C(N1CCN(CC1)C(c1ccccc1)c1ccccc1)c1ccccn1
: