Target
Plectin
Ligand
BDBM48875
Substrate
Meas. Tech.
uHTS identification of small molecule antagonists of the binding of Siah-1 and a peptide ligand via a fluorescence polarization assay.
IC50
24941±n/a nM
Citation
 PubChem, PC uHTS identification of small molecule antagonists of the binding of Siah-1 and a peptide ligand via a fluorescence polarization assay. PubChem Bioassay (2009)[AID] 
Target
Name:
Plectin
Synonyms:
PLEC PLEC_HUMAN | plectin 1
Type:
Enzyme Catalytic Domain
Mol. Mass.:
531740.96
Organism:
Homo sapiens (Human)
Description:
Q15149
Residue:
4684
  
Inhibitor
Name:
BDBM48875
Synonyms:
(4Z)-4-[(4-acetamidoanilino)methylene]-3-keto-N-phenyl-2-naphthamide (4Z)-4-[(4-acetamidoanilino)methylidene]-3-oxo-N-phenylnaphthalene-2-carboxamide 4-((E)-{[4-(acetylamino)phenyl]imino}methyl)-3-hydroxy-N-phenyl-2-naphthamide SMR000312797 | cid_16001802
Type:
Small organic molecule
Emp. Form.:
C26H21N3O3
Mol. Mass.:
423.4632
SMILES:
CC(=O)Nc1ccc(cc1)N=Cc1c(O)c(cc2ccccc12)C(=O)Nc1ccccc1
: