Target
Plectin
Ligand
BDBM54944
Substrate
Meas. Tech.
uHTS identification of small molecule antagonists of the binding of Siah-1 and a peptide ligand via a fluorescence polarization assay.
IC50
5126±n/a nM
Citation
 PubChem, PC uHTS identification of small molecule antagonists of the binding of Siah-1 and a peptide ligand via a fluorescence polarization assay. PubChem Bioassay (2009)[AID] 
Target
Name:
Plectin
Synonyms:
PLEC PLEC_HUMAN | plectin 1
Type:
Enzyme Catalytic Domain
Mol. Mass.:
531740.96
Organism:
Homo sapiens (Human)
Description:
Q15149
Residue:
4684
  
Inhibitor
Name:
BDBM54944
Synonyms:
3-[(E)-(5-chloro-2-hydroxyphenyl)diazenyl]-4,5-dihydroxynaphthalene-2,7-disulfonate SMR000554427 sodium;(3Z)-3-[(5-chloranyl-2-oxidanyl-phenyl)hydrazinylidene]-5-oxidanyl-4-oxidanylidene-naphthalene-2,7-disulfonate sodium;(3Z)-3-[(5-chloro-2-hydroxyphenyl)hydrazinylidene]-5-hydroxy-4-oxonaphthalene-2,7-disulfonate
Type:
Small organic molecule
Emp. Form.:
C16H9ClN2O9S2
Mol. Mass.:
472.835
SMILES:
Oc1ccc(Cl)cc1N=Nc1c(O)c2c(O)cc(cc2cc1S([O-])(=O)=O)S([O-])(=O)=O
: