Target
Large T antigen
Ligand
BDBM60364
Substrate
Meas. Tech.
Identification of SV40 T antigen inhibitors: A route to novel anti-viral reagents
IC50
100000±n/a nM
Citation
 PubChem, PC Identification of SV40 T antigen inhibitors: A route to novel anti-viral reagents PubChem Bioassay (2010)[AID] 
Target
Name:
Large T antigen
Synonyms:
LT LT_SV40
Type:
Enzyme Catalytic Domain
Mol. Mass.:
81575.54
Organism:
Simian virus 40
Description:
P03070
Residue:
708
  
Inhibitor
Name:
BDBM60364
Synonyms:
2-[1-(1,3-benzothiazol-2-yl)-5-keto-3-pyrazolin-3-yl]acetic acid ethyl ester MLS000037146 cid_663162 ethyl 2-[2-(1,3-benzothiazol-2-yl)-3-oxo-1H-pyrazol-5-yl]acetate
Type:
Small organic molecule
Emp. Form.:
C14H13N3O3S
Mol. Mass.:
303.336
SMILES:
CCOC(=O)Cc1cc(=O)n([nH]1)-c1nc2ccccc2s1
: