Target
Large T antigen
Ligand
BDBM60377
Substrate
Meas. Tech.
Identification of SV40 T antigen inhibitors: A route to novel anti-viral reagents
IC50
17240±n/a nM
Citation
 PubChem, PC Identification of SV40 T antigen inhibitors: A route to novel anti-viral reagents PubChem Bioassay (2010)[AID] 
Target
Name:
Large T antigen
Synonyms:
LT LT_SV40
Type:
Enzyme Catalytic Domain
Mol. Mass.:
81575.54
Organism:
Simian virus 40
Description:
P03070
Residue:
708
  
Inhibitor
Name:
BDBM60377
Synonyms:
MLS000047460 N-[4-(dimethylamino)phenyl]-2-[4-[2-(4-fluoroanilino)-2-oxoethyl]-1-piperazinyl]acetamide N-[4-(dimethylamino)phenyl]-2-[4-[2-[(4-fluorophenyl)amino]-2-oxidanylidene-ethyl]piperazin-1-yl]ethanamide cid_3240287
Type:
Small organic molecule
Emp. Form.:
C22H28FN5O2
Mol. Mass.:
413.4884
SMILES:
CN(C)c1ccc(NC(=O)CN2CCN(CC(=O)Nc3ccc(F)cc3)CC2)cc1
: