Target
Large T antigen
Ligand
BDBM40048
Substrate
Meas. Tech.
Identification of SV40 T antigen inhibitors: A route to novel anti-viral reagents
IC50
78580±n/a nM
Citation
 PubChem, PC Identification of SV40 T antigen inhibitors: A route to novel anti-viral reagents PubChem Bioassay (2010)[AID] 
Target
Name:
Large T antigen
Synonyms:
LT LT_SV40
Type:
Enzyme Catalytic Domain
Mol. Mass.:
81575.54
Organism:
Simian virus 40
Description:
P03070
Residue:
708
  
Inhibitor
Name:
BDBM40048
Synonyms:
6-bromanyl-2-(furan-2-yl)quinoline-4-carboxylic acid 6-bromo-2-(2-furyl)cinchoninic acid 6-bromo-2-(furan-2-yl)quinoline-4-carboxylic acid SMR000033614 | cid_686152
Type:
Small organic molecule
Emp. Form.:
C14H8BrNO3
Mol. Mass.:
318.122
SMILES:
OC(=O)c1cc(nc2ccc(Br)cc12)-c1ccco1
: