Target
Large T antigen
Ligand
BDBM58957
Substrate
Meas. Tech.
Identification of SV40 T antigen inhibitors: A route to novel anti-viral reagents
IC50
32020±n/a nM
Citation
 PubChem, PC Identification of SV40 T antigen inhibitors: A route to novel anti-viral reagents PubChem Bioassay (2010)[AID] 
Target
Name:
Large T antigen
Synonyms:
LT LT_SV40
Type:
Enzyme Catalytic Domain
Mol. Mass.:
81575.54
Organism:
Simian virus 40
Description:
P03070
Residue:
708
  
Inhibitor
Name:
BDBM58957
Synonyms:
MLS000050129 N-[4-(diethylamino)-2-methylphenyl]-2-methoxy-3-methylbenzamide cid_959455
Type:
Small organic molecule
Emp. Form.:
C20H26N2O2
Mol. Mass.:
326.4326
SMILES:
CCN(CC)c1ccc(NC(=O)c2cccc(C)c2OC)c(C)c1
: