Target
Large T antigen
Ligand
BDBM60387
Substrate
Meas. Tech.
Identification of SV40 T antigen inhibitors: A route to novel anti-viral reagents
IC50
12530±n/a nM
Citation
 PubChem, PC Identification of SV40 T antigen inhibitors: A route to novel anti-viral reagents PubChem Bioassay (2010)[AID] 
Target
Name:
Large T antigen
Synonyms:
LT LT_SV40
Type:
Enzyme Catalytic Domain
Mol. Mass.:
81575.54
Organism:
Simian virus 40
Description:
P03070
Residue:
708
  
Inhibitor
Name:
BDBM60387
Synonyms:
3'-(4-hydroxyphenyl)-1'H-spiro[cyclohexane-1,2'-quinazolin]-4'(3'H)-one 3-(4-hydroxyphenyl)spiro[1H-quinazoline-2,1'-cyclohexane]-4-one SMR000079352 | cid_686788
Type:
Small organic molecule
Emp. Form.:
C19H20N2O2
Mol. Mass.:
308.3743
SMILES:
Oc1ccc(cc1)N1C(=O)c2ccccc2NC11CCCCC1
: