Target
G-protein coupled receptor 55
Ligand
BDBM61095
Substrate
Meas. Tech.
Image-based HTS for Selective Agonists of GPR55
EC50
507.8214±n/a nM
Citation
 PubChem, PC Image-based HTS for Selective Agonists of GPR55 PubChem Bioassay (2010)[AID] 
Target
Name:
G-protein coupled receptor 55
Synonyms:
G protein-coupled receptor 55 GPR55_HUMAN
Type:
PROTEIN
Mol. Mass.:
36649.72
Organism:
Homo sapiens (Human)
Description:
ChEMBL_1292265
Residue:
319
  
Inhibitor
Name:
BDBM61095
Synonyms:
3-[4-(2,3-dimethylphenyl)piperazin-1-yl]carbonyl-N,N-dimethyl-4-pyrrolidin-1-yl-benzenesulfonamide 3-[4-(2,3-dimethylphenyl)piperazine-1-carbonyl]-N,N-dimethyl-4-pyrrolidino-benzenesulfonamide MLS001002737 cid_2440433
Type:
Small organic molecule
Emp. Form.:
C25H34N4O3S
Mol. Mass.:
470.627
SMILES:
CN(C)S(=O)(=O)c1ccc(N2CCCC2)c(c1)C(=O)N1CCN(CC1)c1cccc(C)c1C
: