Target
G-protein coupled receptor 55
Ligand
BDBM61132
Substrate
Meas. Tech.
Image-based HTS for Selective Agonists of GPR55
EC50
601.3551±n/a nM
Citation
 PubChem, PC Image-based HTS for Selective Agonists of GPR55 PubChem Bioassay (2010)[AID] 
Target
Name:
G-protein coupled receptor 55
Synonyms:
G protein-coupled receptor 55 GPR55_HUMAN
Type:
PROTEIN
Mol. Mass.:
36649.72
Organism:
Homo sapiens (Human)
Description:
ChEMBL_1292265
Residue:
319
  
Inhibitor
Name:
BDBM61132
Synonyms:
1-(4-amino-1,2,5-oxadiazol-3-yl)-N-[[(Z)-2-methyl-3-phenylprop-2-enylidene]amino]-5-[(4-methyl-1-piperidinyl)methyl]-4-triazolecarboxamide 1-(4-aminofurazan-3-yl)-N-[[(Z)-2-methyl-3-phenyl-prop-2-enylidene]amino]-5-[(4-methylpiperidino)methyl]triazole-4-carboxamide MLS000923861 cid_24789557
Type:
Small organic molecule
Emp. Form.:
C22H27N9O2
Mol. Mass.:
449.5089
SMILES:
CC1CCN(Cc2c(nnn2-c2nonc2N)C(=O)NN=C\C(C)=C/c2ccccc2)CC1
: