Target
SUMO-activating enzyme subunit 1
Ligand
BDBM32098
Substrate
Meas. Tech.
uHTS HTRF assay for identification of inhibitors of SUMOylation
IC50
4300±n/a nM
Citation
 PubChem, PC uHTS HTRF assay for identification of inhibitors of SUMOylation PubChem Bioassay (2010)[AID] 
Target
Name:
SUMO-activating enzyme subunit 1
Synonyms:
AOS1 SAE1_HUMAN SUMO-activating enzyme subunit 1 (SAE1) UBLE1A
Type:
Enzyme Catalytic Domain
Mol. Mass.:
38440.84
Organism:
Homo sapiens (Human)
Description:
gi_17390638
Residue:
346
  
Inhibitor
Name:
BDBM32098
Synonyms:
3-(2-methylanilino)-2H-isoquinolin-1-one 3-[(2-methylphenyl)amino]-2H-isoquinolin-1-one MLS000043700 cid_2142222
Type:
Small organic molecule
Emp. Form.:
C16H14N2O
Mol. Mass.:
250.2952
SMILES:
Cc1ccccc1Nc1cc2ccccc2c(=O)[nH]1
: