Target
SUMO-activating enzyme subunit 1
Ligand
BDBM10515
Substrate
Meas. Tech.
uHTS HTRF assay for identification of inhibitors of SUMOylation
IC50
4740±n/a nM
Citation
 PubChem, PC uHTS HTRF assay for identification of inhibitors of SUMOylation PubChem Bioassay (2010)[AID] 
Target
Name:
SUMO-activating enzyme subunit 1
Synonyms:
AOS1 SAE1_HUMAN SUMO-activating enzyme subunit 1 (SAE1) UBLE1A
Type:
Enzyme Catalytic Domain
Mol. Mass.:
38440.84
Organism:
Homo sapiens (Human)
Description:
gi_17390638
Residue:
346
  
Inhibitor
Name:
BDBM10515
Synonyms:
5-(1,2-dithiolan-3-yl)pentanoic acid D,L-Lipoic acid cid_864 | lipoic acid (LA)
Type:
Small organic molecule
Emp. Form.:
C8H14O2S2
Mol. Mass.:
206.326
SMILES:
OC(=O)CCCCC1CCSS1
: