Target
Eukaryotic translation initiation factor 4H
Ligand
BDBM51503
Substrate
Meas. Tech.
uHTS fluorescence polarization assay for the identification of translation initiation inhibitors (eIF4H)
IC50
100000±n/a nM
Citation
 PubChem, PC uHTS fluorescence polarization assay for the identification of translation initiation inhibitors (eIF4H) PubChem Bioassay (2009)[AID] 
Target
Name:
Eukaryotic translation initiation factor 4H
Synonyms:
EIF4H KIAA0038 WSCR1
Type:
Enzyme Catalytic Domain
Mol. Mass.:
27385.24
Organism:
Homo sapiens (Human)
Description:
Q15056
Residue:
248
  
Inhibitor
Name:
BDBM51503
Synonyms:
2-[8-(diethylaminomethyl)-7-hydroxy-2-keto-4-methyl-chromen-3-yl]acetic acid methyl ester;hydrochloride MLS000081528 cid_6603244 methyl 2-[8-(diethylaminomethyl)-7-hydroxy-4-methyl-2-oxochromen-3-yl]acetate;hydrochloride
Type:
Small organic molecule
Emp. Form.:
C18H23NO5
Mol. Mass.:
333.3789
SMILES:
CCN(CC)Cc1c(O)ccc2c(C)c(CC(=O)OC)c(=O)oc12
: