Target
Eukaryotic translation initiation factor 4H
Ligand
BDBM61270
Substrate
Meas. Tech.
uHTS fluorescence polarization assay for the identification of translation initiation inhibitors (eIF4H)
IC50
100000±n/a nM
Citation
 PubChem, PC uHTS fluorescence polarization assay for the identification of translation initiation inhibitors (eIF4H) PubChem Bioassay (2009)[AID] 
Target
Name:
Eukaryotic translation initiation factor 4H
Synonyms:
EIF4H KIAA0038 WSCR1
Type:
Enzyme Catalytic Domain
Mol. Mass.:
27385.24
Organism:
Homo sapiens (Human)
Description:
Q15056
Residue:
248
  
Inhibitor
Name:
BDBM61270
Synonyms:
1-methyl-2,3-dihydroimidazo[1,2-c]quinazolin-4-ium;iodide SMR000035286 | cid_663354
Type:
Small organic molecule
Emp. Form.:
C11H12N3
Mol. Mass.:
186.2325
SMILES:
CN1CCn2cnc3ccccc3[c+]12
: