Target
Eukaryotic translation initiation factor 4H
Ligand
BDBM61273
Substrate
Meas. Tech.
uHTS fluorescence polarization assay for the identification of translation initiation inhibitors (eIF4H)
IC50
100000±n/a nM
Citation
 PubChem, PC uHTS fluorescence polarization assay for the identification of translation initiation inhibitors (eIF4H) PubChem Bioassay (2009)[AID] 
Target
Name:
Eukaryotic translation initiation factor 4H
Synonyms:
EIF4H KIAA0038 WSCR1
Type:
Enzyme Catalytic Domain
Mol. Mass.:
27385.24
Organism:
Homo sapiens (Human)
Description:
Q15056
Residue:
248
  
Inhibitor
Name:
BDBM61273
Synonyms:
2-[2-[[5-[1-(dimethylamino)propyl]-4-(2-morpholin-4-ylethyl)-1,2,4-triazol-3-yl]sulfanyl]ethylamino]ethanol;ethanedioic acid 2-[2-[[5-[1-(dimethylamino)propyl]-4-(2-morpholinoethyl)-1,2,4-triazol-3-yl]thio]ethylamino]ethanol;oxalic acid MLS000053561 cid_2998827
Type:
Small organic molecule
Emp. Form.:
C17H34N6O2S
Mol. Mass.:
386.556
SMILES:
CCC(N(C)C)c1nnc(SCCNCCO)n1CCN1CCOCC1
: