Target
Eukaryotic translation initiation factor 4H
Ligand
BDBM61285
Substrate
Meas. Tech.
uHTS fluorescence polarization assay for the identification of translation initiation inhibitors (eIF4H)
IC50
14685±n/a nM
Citation
 PubChem, PC uHTS fluorescence polarization assay for the identification of translation initiation inhibitors (eIF4H) PubChem Bioassay (2009)[AID] 
Target
Name:
Eukaryotic translation initiation factor 4H
Synonyms:
EIF4H KIAA0038 WSCR1
Type:
Enzyme Catalytic Domain
Mol. Mass.:
27385.24
Organism:
Homo sapiens (Human)
Description:
Q15056
Residue:
248
  
Inhibitor
Name:
BDBM61285
Synonyms:
2-[2-[(N''E)-N''-[3-(2,4-dichlorobenzyl)oxy-4-methoxy-benzylidene]hydrazino]-4-keto-2-thiazolin-5-yl]acetic acid 2-[2-[2-[[3-[(2,4-dichlorophenyl)methoxy]-4-methoxy-phenyl]methylidene]hydrazinyl]-4-oxidanylidene-1,3-thiazol-5-yl]ethanoic acid 2-[2-[2-[[3-[(2,4-dichlorophenyl)methoxy]-4-methoxyphenyl]methylidene]hydrazinyl]-4-oxo-5-thiazolyl]acetic acid MLS000574282 [2-({3-[(2,4-dichlorobenzyl)oxy]-4-methoxybenzylidene}hydrazono)-4-oxo-1,3-thiazolidin-5-yl]acetic acid | cid_2908089
Type:
Small organic molecule
Emp. Form.:
C20H17Cl2N3O5S
Mol. Mass.:
482.337
SMILES:
COc1ccc(CN=Nc2nc(O)c(CC(O)=O)s2)cc1OCc1ccc(Cl)cc1Cl
: