Target
Eukaryotic translation initiation factor 4H
Ligand
BDBM61286
Substrate
Meas. Tech.
uHTS fluorescence polarization assay for the identification of translation initiation inhibitors (eIF4H)
IC50
12265±n/a nM
Citation
 PubChem, PC uHTS fluorescence polarization assay for the identification of translation initiation inhibitors (eIF4H) PubChem Bioassay (2009)[AID] 
Target
Name:
Eukaryotic translation initiation factor 4H
Synonyms:
EIF4H KIAA0038 WSCR1
Type:
Enzyme Catalytic Domain
Mol. Mass.:
27385.24
Organism:
Homo sapiens (Human)
Description:
Q15056
Residue:
248
  
Inhibitor
Name:
BDBM61286
Synonyms:
2-(1-ethylbenzimidazol-2-yl)sulfanyl-N-[[(Z)-3-(furan-2-yl)prop-2-enylidene]amino]acetamide 2-[(1-ethyl-1H-benzimidazol-2-yl)thio]-N'-[(1E,2Z)-3-(2-furyl)prop-2-enylidene]acetohydrazide 2-[(1-ethylbenzimidazol-2-yl)thio]-N-[[(Z)-3-(2-furyl)prop-2-enylidene]amino]acetamide SMR000203745 | cid_12005014
Type:
Small organic molecule
Emp. Form.:
C18H18N4O2S
Mol. Mass.:
354.426
SMILES:
CCn1c(SCC(=O)NN=C\C=C/c2ccco2)nc2ccccc12
: