Target
Eukaryotic translation initiation factor 4H
Ligand
BDBM33143
Substrate
Meas. Tech.
uHTS fluorescence polarization assay for the identification of translation initiation inhibitors (eIF4H)
IC50
59210±n/a nM
Citation
 PubChem, PC uHTS fluorescence polarization assay for the identification of translation initiation inhibitors (eIF4H) PubChem Bioassay (2009)[AID] 
Target
Name:
Eukaryotic translation initiation factor 4H
Synonyms:
EIF4H KIAA0038 WSCR1
Type:
Enzyme Catalytic Domain
Mol. Mass.:
27385.24
Organism:
Homo sapiens (Human)
Description:
Q15056
Residue:
248
  
Inhibitor
Name:
BDBM33143
Synonyms:
(4E)-2,3-dihydroxy-4-[[(2-methylimino-4-thiophen-2-yl-1,3-thiazol-3-yl)amino]methylidene]cyclohexa-2,5-dien-1-one (4E)-2,3-dihydroxy-4-[[[2-methylimino-4-(2-thienyl)-4-thiazolin-3-yl]amino]methylene]cyclohexa-2,5-dien-1-one MLS000374760 cid_5957103
Type:
Small organic molecule
Emp. Form.:
C15H13N3O3S2
Mol. Mass.:
347.412
SMILES:
CN=c1scc(-c2cccs2)n1N=Cc1ccc(O)c(O)c1O
: