Target
Eukaryotic translation initiation factor 4H
Ligand
BDBM61325
Substrate
Meas. Tech.
uHTS fluorescence polarization assay for the identification of translation initiation inhibitors (eIF4H)
IC50
7710±n/a nM
Citation
 PubChem, PC uHTS fluorescence polarization assay for the identification of translation initiation inhibitors (eIF4H) PubChem Bioassay (2009)[AID] 
Target
Name:
Eukaryotic translation initiation factor 4H
Synonyms:
EIF4H KIAA0038 WSCR1
Type:
Enzyme Catalytic Domain
Mol. Mass.:
27385.24
Organism:
Homo sapiens (Human)
Description:
Q15056
Residue:
248
  
Inhibitor
Name:
BDBM61325
Synonyms:
1-N,3-N-bis(2-hydroxy-5-nitrophenyl)benzene-1,3-dicarboxamide N,N'-bis(2-hydroxy-5-nitrophenyl)isophthalamide N1,N3-bis(2-hydroxy-5-nitrophenyl)benzene-1,3-dicarboxamide SMR000495849 | cid_3823676
Type:
Small organic molecule
Emp. Form.:
C20H14N4O8
Mol. Mass.:
438.3472
SMILES:
Oc1ccc(cc1NC(=O)c1cccc(c1)C(=O)Nc1cc(ccc1O)[N+]([O-])=O)[N+]([O-])=O
: