Target
Eukaryotic translation initiation factor 4H
Ligand
BDBM831
Substrate
Meas. Tech.
uHTS fluorescence polarization assay for the identification of translation initiation inhibitors (eIF4H)
IC50
100000±n/a nM
Citation
 PubChem, PC uHTS fluorescence polarization assay for the identification of translation initiation inhibitors (eIF4H) PubChem Bioassay (2009)[AID] 
Target
Name:
Eukaryotic translation initiation factor 4H
Synonyms:
EIF4H KIAA0038 WSCR1
Type:
Enzyme Catalytic Domain
Mol. Mass.:
27385.24
Organism:
Homo sapiens (Human)
Description:
Q15056
Residue:
248
  
Inhibitor
Name:
BDBM831
Synonyms:
9-chloro-2-keto-8,8-dimethyl-pyrano[2,3-f]chromene-10-carbaldehyde oxime | cid_6898412
Type:
Emp. Form.:
C15H12ClNO4
Mol. Mass.:
305.713
SMILES:
CC1(C)Oc2ccc3ccc(=O)oc3c2C(CN=O)=C1Cl
: