Target
G-protein coupled receptor 55
Ligand
BDBM54009
Substrate
Meas. Tech.
Image-Based HTS for Selective Antagonists for GPR55
IC50
1178.436±n/a nM
Citation
 PubChem, PC Image-Based HTS for Selective Antagonists for GPR55 PubChem Bioassay (2010)[AID] 
Target
Name:
G-protein coupled receptor 55
Synonyms:
G protein-coupled receptor 55 GPR55_HUMAN
Type:
PROTEIN
Mol. Mass.:
36649.72
Organism:
Homo sapiens (Human)
Description:
ChEMBL_1292265
Residue:
319
  
Inhibitor
Name:
BDBM54009
Synonyms:
4-[4-(3-hydroxyphenyl)-3-(4-methylphenyl)-6-oxidanylidene-1,4-dihydropyrrolo[3,4-c]pyrazol-5-yl]benzoic acid 4-[4-(3-hydroxyphenyl)-3-(4-methylphenyl)-6-oxo-4,6-dihydropyrrolo[3,4-c]pyrazol-5(1H)-yl]benzoic acid MLS000675307 cid_16020046
Type:
Small organic molecule
Emp. Form.:
C25H19N3O4
Mol. Mass.:
425.4361
SMILES:
Cc1ccc(cc1)-c1n[nH]c2C(=O)N(C(c12)c1cccc(O)c1)c1ccc(cc1)C(O)=O
: