Target
G-protein coupled receptor 55
Ligand
BDBM61571
Substrate
Meas. Tech.
Image-Based HTS for Selective Antagonists for GPR55
IC50
664.9516±n/a nM
Citation
 PubChem, PC Image-Based HTS for Selective Antagonists for GPR55 PubChem Bioassay (2010)[AID] 
Target
Name:
G-protein coupled receptor 55
Synonyms:
G protein-coupled receptor 55 GPR55_HUMAN
Type:
PROTEIN
Mol. Mass.:
36649.72
Organism:
Homo sapiens (Human)
Description:
ChEMBL_1292265
Residue:
319
  
Inhibitor
Name:
BDBM61571
Synonyms:
3-(5-{[3-(4-methoxy-2-methylphenyl)-1-phenyl-1H-pyrazol-4-yl]methylene}-4-oxo-2-thioxo-1,3-thiazolidin-3-yl)propanoic acid 3-[(5E)-5-[[3-(4-methoxy-2-methyl-phenyl)-1-phenyl-pyrazol-4-yl]methylidene]-4-oxidanylidene-2-sulfanylidene-1,3-thiazolidin-3-yl]propanoic acid 3-[(5E)-5-[[3-(4-methoxy-2-methylphenyl)-1-phenylpyrazol-4-yl]methylidene]-4-oxo-2-sulfanylidene-1,3-thiazolidin-3-yl]propanoic acid SMR000497337 | cid_1328217
Type:
Small organic molecule
Emp. Form.:
C24H21N3O4S2
Mol. Mass.:
479.571
SMILES:
COc1ccc(-c2nn(cc2\C=C2\SC(=S)N(CCC(O)=O)C2=O)-c2ccccc2)c(C)c1
: