Target
Polyadenylate-binding protein 1
Ligand
BDBM61294
Substrate
Meas. Tech.
uHTS fluorescence polarization assay for the identification of translation initiation inhibitors (PABP)
IC50
6050±n/a nM
Citation
 PubChem, PC uHTS fluorescence polarization assay for the identification of translation initiation inhibitors (PABP) PubChem Bioassay (2009)[AID] 
Target
Name:
Polyadenylate-binding protein 1
Synonyms:
PAB1 PABP1 PABPC1 poly(A) binding protein, cytoplasmic 1 | polyadenylate-binding protein 1
Type:
Enzyme Catalytic Domain
Mol. Mass.:
70694.26
Organism:
Homo sapiens (Human)
Description:
gi_46367787
Residue:
636
  
Inhibitor
Name:
BDBM61294
Synonyms:
1-(1,4-dioxaspiro[4.5]decan-3-ylmethyl)-1-methyl-piperidin-1-ium;iodide MLS000712515 cid_16192757
Type:
Small organic molecule
Emp. Form.:
C15H28NO2
Mol. Mass.:
254.3878
SMILES:
C[N+]1(CC2COC3(CCCCC3)O2)CCCCC1
: