Target
Polyadenylate-binding protein 1
Ligand
BDBM61373
Substrate
Meas. Tech.
uHTS fluorescence polarization assay for the identification of translation initiation inhibitors (PABP)
IC50
100000±n/a nM
Citation
 PubChem, PC uHTS fluorescence polarization assay for the identification of translation initiation inhibitors (PABP) PubChem Bioassay (2009)[AID] 
Target
Name:
Polyadenylate-binding protein 1
Synonyms:
PAB1 PABP1 PABPC1 poly(A) binding protein, cytoplasmic 1 | polyadenylate-binding protein 1
Type:
Enzyme Catalytic Domain
Mol. Mass.:
70694.26
Organism:
Homo sapiens (Human)
Description:
gi_46367787
Residue:
636
  
Inhibitor
Name:
BDBM61373
Synonyms:
3-(4-bromophenyl)sulfonyl-1-[4-(4-fluorophenyl)-1-piperazinyl]-1-propanone 3-brosyl-1-[4-(4-fluorophenyl)piperazino]propan-1-one SMR000635586 | cid_3495780
Type:
Small organic molecule
Emp. Form.:
C19H20BrFN2O3S
Mol. Mass.:
455.341
SMILES:
Fc1ccc(cc1)N1CCN(CC1)C(=O)CCS(=O)(=O)c1ccc(Br)cc1
: