Target
G-protein coupled receptor 35
Ligand
BDBM29653
Substrate
Meas. Tech.
Image-Based HTS for Selective Antagonists of GPR35
IC50
4296.502±n/a nM
Citation
 PubChem, PC Image-Based HTS for Selective Antagonists of GPR35 PubChem Bioassay (2010)[AID] 
Target
Name:
G-protein coupled receptor 35
Synonyms:
G protein-coupled receptor 35 GPR35_HUMAN
Type:
Enzyme Catalytic Domain
Mol. Mass.:
34085.57
Organism:
Homo sapiens (Human)
Description:
gi_33695097
Residue:
309
  
Inhibitor
Name:
BDBM29653
Synonyms:
3-(4-chlorobenzyl)-1,4-diketo-naphthalene-2-carboxylic acid ethyl ester MLS000532056 cid_2841621 ethyl 3-[(4-chlorophenyl)methyl]-1,4-bis(oxidanylidene)naphthalene-2-carboxylate | ethyl 3-[(4-chlorophenyl)methyl]-1,4-dioxonaphthalene-2-carboxylate
Type:
Small organic molecule
Emp. Form.:
C20H15ClO4
Mol. Mass.:
354.784
SMILES:
CCOC(=O)C1=C(Cc2ccc(Cl)cc2)C(=O)c2ccccc2C1=O
: