Target
G-protein coupled receptor 35
Ligand
BDBM61638
Substrate
Meas. Tech.
Image-Based HTS for Selective Antagonists of GPR35
IC50
3849.648±n/a nM
Citation
 PubChem, PC Image-Based HTS for Selective Antagonists of GPR35 PubChem Bioassay (2010)[AID] 
Target
Name:
G-protein coupled receptor 35
Synonyms:
G protein-coupled receptor 35 GPR35_HUMAN
Type:
Enzyme Catalytic Domain
Mol. Mass.:
34085.57
Organism:
Homo sapiens (Human)
Description:
gi_33695097
Residue:
309
  
Inhibitor
Name:
BDBM61638
Synonyms:
(E)-2-cyano-3-(5-nitro-2-furanyl)-N-(1-phenylethyl)-2-propenamide (E)-2-cyano-3-(5-nitrofuran-2-yl)-N-(1-phenylethyl)prop-2-enamide SMR000590532 | cid_6393553
Type:
Small organic molecule
Emp. Form.:
C16H13N3O4
Mol. Mass.:
311.2921
SMILES:
CC(NC(=O)C(=C\c1ccc(o1)[N+]([O-])=O)\C#N)c1ccccc1
: