Target
G-protein coupled receptor 35
Ligand
BDBM61656
Substrate
Meas. Tech.
Image-Based HTS for Selective Antagonists of GPR35
IC50
1509.729±n/a nM
Citation
 PubChem, PC Image-Based HTS for Selective Antagonists of GPR35 PubChem Bioassay (2010)[AID] 
Target
Name:
G-protein coupled receptor 35
Synonyms:
G protein-coupled receptor 35 GPR35_HUMAN
Type:
Enzyme Catalytic Domain
Mol. Mass.:
34085.57
Organism:
Homo sapiens (Human)
Description:
gi_33695097
Residue:
309
  
Inhibitor
Name:
BDBM61656
Synonyms:
4-[4-[(5E)-2-oxidanylidene-5-(phenylmethylidene)-4-sulfanylidene-1,3-thiazolidin-3-yl]butanoylamino]benzoic acid 4-[4-[(5E)-5-benzylidene-2-oxo-4-sulfanylidene-1,3-thiazolidin-3-yl]butanoylamino]benzoic acid MLS001167691 cid_1382708
Type:
Small organic molecule
Emp. Form.:
C21H18N2O4S2
Mol. Mass.:
426.509
SMILES:
OC(=O)c1ccc(NC(=O)CCCN2C(=O)S\C(=C\c3ccccc3)C2=S)cc1
: