Target
Voltage-dependent N-type calcium channel subunit alpha-1B
Ligand
BDBM33049
Substrate
Meas. Tech.
Homogeneous Time-Resolved Fluorescence Resonance Energy Transfer (HTRF) Assay
IC50
738±n/a nM
Citation
 PubChem, PC Homogeneous Time-Resolved Fluorescence Resonance Energy Transfer (HTRF) Assay PubChem Bioassay (2009)[AID] 
Target
Name:
Voltage-dependent N-type calcium channel subunit alpha-1B
Synonyms:
BIII CAC1B_HUMAN CACNA1B Calcium channel (Type N) Voltage-dependent N-type calcium channel subunit alpha-1B Voltage-gated N-type calcium channel alpha-1B subunit Voltage-gated calcium channel Voltage-gated calcium channel subunit alpha Cav2.2 ((alpha 1B, beta 1b, alpha 2 delta-1) | calcium channel, voltage-dependent, N type, alpha 1B subunit
Type:
Enzyme
Mol. Mass.:
262548.16
Organism:
Homo sapiens (Human)
Description:
Q00975
Residue:
2339
  
Inhibitor
Name:
BDBM33049
Synonyms:
(4-chlorodithiazol-5-ylidene)-(3,5-dimethoxyphenyl)amine 4-chloro-N-(3,5-dimethoxyphenyl)-5-dithiazolimine MLS000044018 SMR000021429 | cid_715724
Type:
Small organic molecule
Emp. Form.:
C10H9ClN2O2S2
Mol. Mass.:
288.774
SMILES:
COc1cc(OC)cc(c1)\N=c1\ssnc1Cl
: