Target
Voltage-dependent N-type calcium channel subunit alpha-1B
Ligand
BDBM34943
Substrate
Meas. Tech.
Homogeneous Time-Resolved Fluorescence Resonance Energy Transfer (HTRF) Assay
IC50
2730±n/a nM
Citation
 PubChem, PC Homogeneous Time-Resolved Fluorescence Resonance Energy Transfer (HTRF) Assay PubChem Bioassay (2009)[AID] 
Target
Name:
Voltage-dependent N-type calcium channel subunit alpha-1B
Synonyms:
BIII CAC1B_HUMAN CACNA1B Calcium channel (Type N) Voltage-dependent N-type calcium channel subunit alpha-1B Voltage-gated N-type calcium channel alpha-1B subunit Voltage-gated calcium channel Voltage-gated calcium channel subunit alpha Cav2.2 ((alpha 1B, beta 1b, alpha 2 delta-1) | calcium channel, voltage-dependent, N type, alpha 1B subunit
Type:
Enzyme
Mol. Mass.:
262548.16
Organism:
Homo sapiens (Human)
Description:
Q00975
Residue:
2339
  
Inhibitor
Name:
BDBM34943
Synonyms:
3-(2-hydrazino-2-keto-ethoxy)pyrid[1,2-a]indole-10-carboxylic acid ethyl ester MLS000764221 cid_1484849 ethyl 3-(2-hydrazino-2-oxoethoxy)pyrido[1,2-a]indole-10-carboxylate | ethyl 3-(2-hydrazinyl-2-oxoethoxy)pyrido[1,2-a]indole-10-carboxylate
Type:
Small organic molecule
Emp. Form.:
C17H17N3O4
Mol. Mass.:
327.3346
SMILES:
CCOC(=O)c1c2ccc(OCC(=O)NN)cc2n2ccccc12
: